Target
Retinoic acid receptor beta
Ligand
BDBM50265921
Substrate
Meas. Tech.
ChEMBL_544806 (CHEMBL1011986)
EC50
26±n/a nM
Citation
 Charton, JDeprez-Poulain, RHennuyer, NTailleux, AStaels, BDeprez, B Novel non-carboxylic acid retinoids: 1,2,4-oxadiazol-5-one derivatives. Bioorg Med Chem Lett 19:489-92 (2008)  
Target
Name:
Retinoic acid receptor beta
Synonyms:
HAP NR1B2 RAR-beta RARB Retinoic acid receptor RXR-alpha/Retinoic acid receptor beta Retinoid receptor
Type:
PROTEIN
Mol. Mass.:
50498.70
Organism:
Homo sapiens (Human)
Description:
ChEMBL_1458015
Residue:
455
  
Inhibitor
Name:
BDBM50265921
Synonyms:
3-(4-((5,5,8,8-tetramethyl-5,6,7,8-tetrahydronaphthalen-2-yl)ethynyl)phenyl)-1,2,4-oxadiazol-5(4H)-one | CHEMBL468608
Type:
Small organic molecule
Emp. Form.:
C24H24N2O2
Mol. Mass.:
372.4596
SMILES:
CC1(C)CCC(C)(C)c2cc(ccc12)C#Cc1ccc(cc1)-c1nc(=O)o[nH]1
: