Target
Prostaglandin E2 receptor EP3 subtype
Ligand
BDBM50255125
Substrate
Meas. Tech.
ChEMBL_515713 (CHEMBL993101)
IC50
2.5±n/a nM
Citation
 O'Connell, MZeller, WBurgeson, JMishra, RKRamirez, JKiselyov, ASAndrésson, TGurney, MESingh, J Peri-substituted hexahydro-indolones as novel, potent and selective human EP3 receptor antagonists. Bioorg Med Chem Lett 19:778-82 (2009)  
Target
Name:
Prostaglandin E2 receptor EP3 subtype
Synonyms:
PE2R3_HUMAN PGE2-R Prostaglandin E2 receptor Prostaglandin E2 receptor EP3 subtype (EP3) Prostaglandin E2 receptor EP3D subtype (EP3D) | Prostanoid EP3 receptor
Type:
Enzyme
Mol. Mass.:
43335.03
Organism:
Homo sapiens (Human)
Description:
P43115
Residue:
390
  
Inhibitor
Name:
BDBM50255125
Synonyms:
CHEMBL481823 | N-(3,4-difluorophenylsulfonyl)-3-(1-(4-fluorobenzyl)-3a-methyl-2-oxo-2,3,3a,4,5,6-hexahydro-1H-indol-7-yl)acrylamide
Type:
Small organic molecule
Emp. Form.:
C25H23F3N2O4S
Mol. Mass.:
504.521
SMILES:
CC12CC(=O)N(Cc3ccc(F)cc3)C1=C(CCC2)\C=C\C(=O)NS(=O)(=O)c1ccc(F)c(F)c1
: