Target
Glutamate receptor ionotropic, NMDA 1
Ligand
BDBM50004960
Substrate
Meas. Tech.
ChEBML_140324
Ki
980±n/a nM
Citation
 Smith, ECMcQuaid, LACalligaro, DOO'Malley, PJ Structure-activity relationships of a series of glycine antagonists related to 5,7-dichlorokynurenic acid and 3-(2-carboxy-6-chloroindol-3-yl)acetic acid Bioorg Med Chem Lett 3:81-84 (1993)    Article 
Target
Name:
Glutamate receptor ionotropic, NMDA 1
Synonyms:
Glutamate (NMDA) receptor subunit zeta 1 Glutamate-NMDA-Channel Glutamate-NMDA-Polyamine NMDA Nmdar1 | phencyclidine
Type:
Enzyme Catalytic Domain
Mol. Mass.:
105533.40
Organism:
RAT
Description:
P35439
Residue:
938
  
Inhibitor
Name:
BDBM50004960
Synonyms:
4,6-Dichloro-1H-indole-2-carboxylic acid | CHEMBL301556
Type:
Small organic molecule
Emp. Form.:
C9H5Cl2NO2
Mol. Mass.:
230.047
SMILES:
OC(=O)c1cc2c(Cl)cc(Cl)cc2[nH]1
: