Target
Serine protease 1
Ligand
BDBM50067889
Substrate
Meas. Tech.
ChEBML_212198
Ki
170000±n/a nM
Citation
 Steiner, SJBien, JTSmith, BD Diphenylborinic acid is a strong inhibitor of serine proteases Bioorg Med Chem Lett 4:2417-2420 (1994)    Article 
Target
Name:
Serine protease 1
Synonyms:
Beta-Trypsin PRSS1 TRY1 TRYP1 Trypsin I
Type:
Enzyme
Mol. Mass.:
25790.52
Organism:
Bos taurus (bovine)
Description:
P00760
Residue:
246
  
Inhibitor
Name:
BDBM50067889
Synonyms:
CHEMBL81556 | Diphenyl Borinic acid
Type:
Small organic molecule
Emp. Form.:
C12H11BO
Mol. Mass.:
182.026
SMILES:
OB(c1ccccc1)c1ccccc1
: