Target
Proprotein convertase subtilisin/kexin type 9
Ligand
BDBM50067889
Substrate
Meas. Tech.
ChEBML_206131
Ki
30000±n/a nM
Citation
 Steiner, SJBien, JTSmith, BD Diphenylborinic acid is a strong inhibitor of serine proteases Bioorg Med Chem Lett 4:2417-2420 (1994)    Article 
Target
Name:
Proprotein convertase subtilisin/kexin type 9
Synonyms:
NARC-1 Neural apoptosis-regulated convertase 1 PCSK9 Proprotein convertase 9 Proprotein convertase subtilisin/kexin type 9 (PCSK9) Subtilisin/kexin-like protease PC9
Type:
Enzyme
Mol. Mass.:
74286.93
Organism:
Homo sapiens (Human)
Description:
Q8NBP7
Residue:
692
  
Inhibitor
Name:
BDBM50067889
Synonyms:
CHEMBL81556 | Diphenyl Borinic acid
Type:
Small organic molecule
Emp. Form.:
C12H11BO
Mol. Mass.:
182.026
SMILES:
OB(c1ccccc1)c1ccccc1
: