Target
Chymotrypsinogen A
Ligand
BDBM50067889
Substrate
Meas. Tech.
ChEBML_49584
Ki
20000±n/a nM
Citation
 Steiner, SJBien, JTSmith, BD Diphenylborinic acid is a strong inhibitor of serine proteases Bioorg Med Chem Lett 4:2417-2420 (1994)    Article 
Target
Name:
Chymotrypsinogen A
Synonyms:
Alpha-chymotrypsin Chymotrypsin A Chymotrypsin A chain B Chymotrypsinogen A | alpha-Chymotrypsin (α-Chymotrypsin)
Type:
Serine protease
Mol. Mass.:
25670.88
Organism:
Bos taurus (bovine)
Description:
Residue:
245
  
Inhibitor
Name:
BDBM50067889
Synonyms:
CHEMBL81556 | Diphenyl Borinic acid
Type:
Small organic molecule
Emp. Form.:
C12H11BO
Mol. Mass.:
182.026
SMILES:
OB(c1ccccc1)c1ccccc1
: