Target
Chymotrypsinogen A
Ligand
BDBM50280216
Substrate
Meas. Tech.
ChEBML_49584
Ki
8000±n/a nM
Citation
 Steiner, SJBien, JTSmith, BD Diphenylborinic acid is a strong inhibitor of serine proteases Bioorg Med Chem Lett 4:2417-2420 (1994)    Article 
Target
Name:
Chymotrypsinogen A
Synonyms:
Alpha-chymotrypsin Chymotrypsin A Chymotrypsin A chain B Chymotrypsinogen A | alpha-Chymotrypsin (α-Chymotrypsin)
Type:
Serine protease
Mol. Mass.:
25670.88
Organism:
Bos taurus (bovine)
Description:
Residue:
245
  
Inhibitor
Name:
BDBM50280216
Synonyms:
Borinic acid derivative Phenyl butyl borinic acid
Type:
Small organic molecule
Emp. Form.:
C10H15BO
Mol. Mass.:
162.037
SMILES:
CCCCB(O)c1ccccc1
: