Target
Leukotriene B4 receptor 1
Ligand
BDBM50052017
Substrate
Meas. Tech.
ChEBML_99648
IC50
11±n/a nM
Citation
 Djuric', SWDocter, SHYu, SSTsai, BSAnglin, CPGaginella, TSKachur, JFKeith, RHMaziasz, TJVillani-Price, DRao, TSWalsh, REWidomski, DLFretland, DJ Synthesis and pharmacological activity of SC-53228, a leukotriene B4 receptor antagonist with high intrinsic potency and selectivity Bioorg Med Chem Lett 4:811-816 (1994)    Article 
Target
Name:
Leukotriene B4 receptor 1
Synonyms:
BLT BLTR Chemoattractant receptor-like 1 GPR16 LTB4-R 1 Leukotriene B4 R1 Leukotriene B4 receptor 1 P2Y purinoceptor 7 | P2Y7
Type:
Enzyme Catalytic Domain
Mol. Mass.:
37582.68
Organism:
Homo sapiens (Human)
Description:
Q15722
Residue:
352
  
Inhibitor
Name:
BDBM50052017
Synonyms:
3-{7-[3-(2-Cyclopropylmethyl-3-methoxy-4-methylcarbamoyl-phenoxy)-propoxy]-8-propyl-chroman-2-yl}-propionic acid SC-51146
Type:
Small organic molecule
Emp. Form.:
C31H41NO7
Mol. Mass.:
539.6597
SMILES:
CCCc1c(OCCCOc2ccc(C(=O)NC)c(OC)c2CC2CC2)ccc2CCC(CCC(O)=O)Oc12
: