Target
Substance-P receptor
Ligand
BDBM50000041
Substrate
Meas. Tech.
ChEMBL_142887 (CHEMBL747298)
IC50
0.5±n/a nM
Citation
 Mills, SGMacCoss, MUnderwood, DShah, SKFinke, PEMiller, DJBudhu, RJCascieri, MASadowski, SStrader, CD 1,2,3-Trisubstituted cyclohexyl substance P antagonists: significance of the ring nitrogen in piperidine-based NK-1 receptor antagonists Bioorg Med Chem Lett 5:1345-1350 (1995)    Article 
Target
Name:
Substance-P receptor
Synonyms:
NK-1 receptor NK1 Receptor NK1R_HUMAN Neurokinin-1 (NK-1) SPR TACR1 Tachykinin receptor 1 (NK1) | tachykinin
Type:
G Protein-Coupled Receptor (GPCR)
Mol. Mass.:
46254.43
Organism:
Homo sapiens (Human)
Description:
P25103
Residue:
407
  
Inhibitor
Name:
BDBM50000041
Synonyms:
(+) (2-Methoxy-benzyl)-(2-phenyl-piperidin-3-yl)-amine (+/-)(2-Methoxy-benzyl)-(2-phenyl-piperidin-3-yl)-amine (-)-(2-Methoxy-benzyl)-(2-phenyl-piperidin-3-yl)-amine (2-Methoxy-benzyl)-((2S,3S)-2-phenyl-piperidin-3-yl)-amine (2S,3S)-3-(2-Methoxy-benzyloxy)-2-phenyl-piperidine CHEMBL2114310 CP 99994 Tritiated-(2-Methoxy-benzyl)-(2-phenyl-piperidin-3-yl)-amine
Type:
Small organic molecule
Emp. Form.:
C19H24N2O
Mol. Mass.:
296.4067
SMILES:
COc1ccccc1CN[C@H]1CCCN[C@H]1c1ccccc1
: