Target
Type-1 angiotensin II receptor B
Ligand
BDBM50285167
Substrate
Meas. Tech.
ChEBML_36640
IC50
4.5±n/a nM
Citation
 Dorsch, DMederski, WWOsswald, MBeier, NSchelling, P Uracil-based angiotensin II receptor antagonists Bioorg Med Chem Lett 5:2071-2076 (1995)    Article 
Target
Name:
Type-1 angiotensin II receptor B
Synonyms:
AGTRB_RAT Agtr1 Angiotensin II AT1B Angiotensin II type 1b (AT-1b) receptor Type-1B angiotensin II receptor
Type:
Enzyme Catalytic Domain
Mol. Mass.:
40929.44
Organism:
RAT
Description:
Angiotensin II AT1B 0 RAT::P29089
Residue:
359
  
Inhibitor
Name:
BDBM50285167
Synonyms:
6-Butyl-3-methyl-1-[2'-(1H-tetrazol-5-yl)-biphenyl-4-ylmethyl]-1H-pyrimidine-2,4-dione | CHEMBL292316
Type:
Small organic molecule
Emp. Form.:
C23H24N6O2
Mol. Mass.:
416.4757
SMILES:
CCCCc1cc(=O)n(C)c(=O)n1Cc1ccc(cc1)-c1ccccc1-c1nnn[nH]1
: