Target
Type-1 angiotensin II receptor
Ligand
BDBM50285161
Substrate
Meas. Tech.
ChEBML_36623
IC50
55±n/a nM
Citation
 Dorsch, DMederski, WWOsswald, MBeier, NSchelling, P Uracil-based angiotensin II receptor antagonists Bioorg Med Chem Lett 5:2071-2076 (1995)    Article 
Target
Name:
Type-1 angiotensin II receptor
Synonyms:
AGTR1 Angiotensin II type 1a (AT-1a) receptor
Type:
PROTEIN
Mol. Mass.:
41107.81
Organism:
Bos taurus
Description:
ChEMBL_36779
Residue:
359
  
Inhibitor
Name:
BDBM50285161
Synonyms:
3-Methyl-6-propyl-1-[2'-(1H-tetrazol-5-yl)-biphenyl-4-ylmethyl]-1H-pyrimidine-2,4-dione | CHEMBL305350
Type:
Small organic molecule
Emp. Form.:
C22H22N6O2
Mol. Mass.:
402.4491
SMILES:
CCCc1cc(=O)n(C)c(=O)n1Cc1ccc(cc1)-c1ccccc1-c1nnn[nH]1
: