Target
Capsid scaffolding protein
Ligand
BDBM50288089
Substrate
Meas. Tech.
ChEBML_158781
IC50
25000±n/a nM
Citation
 Jarvest, RLParratt, MJDebouck, CMGorniak, JGJennings, LJSerafinowska, HTStrickler, JE Inhibition of HSV-1 protease by benzoxazinones Bioorg Med Chem Lett 6:2463-2466 (1996)    Article 
Target
Name:
Capsid scaffolding protein
Synonyms:
Human herpesvirus 1 protease UL26
Type:
PROTEIN
Mol. Mass.:
66472.05
Organism:
Human herpesvirus 1 (strain 17) (HHV-1) (Human herpes simplex virus1)
Description:
ChEMBL_158648
Residue:
635
  
Inhibitor
Name:
BDBM50288089
Synonyms:
2-(4-Oxo-4H-benzo[d][1,3]oxazin-2-ylamino)-propionic acid methyl ester | CHEMBL82698
Type:
Small organic molecule
Emp. Form.:
C12H12N2O4
Mol. Mass.:
248.2347
SMILES:
COC(=O)C(C)Nc1nc2ccccc2c(=O)o1
: