Target
Stromelysin-1
Ligand
BDBM50290677
Substrate
Meas. Tech.
ChEBML_101947
IC50
1400±n/a nM
Citation
 Baxter, ADBhogal, RBird, JBBuckley, GMGregory, DSHedger, PCManallack, DTMassil, TMinton, KJMontana, JGNeidle, SOwen, DAWatson, RJ Mercaptoacyl matrix metalloproteinase inhibitors: The effect of substitution at the mercaptoacyl moiety Bioorg Med Chem Lett 7:2765-2770 (1997)    Article 
Target
Name:
Stromelysin-1
Synonyms:
MMP-3 MMP3_HUMAN Matrix metalloproteinase 3 Matrix metalloproteinase-3 (MMP-3) SL-1 Stromelysin 1 | Transin-1
Type:
Enzyme
Mol. Mass.:
53973.13
Organism:
Homo sapiens (Human)
Description:
P08254
Residue:
477
  
Inhibitor
Name:
BDBM50290677
Synonyms:
(S)-2-(2-Mercapto-3-methyl-butyrylamino)-4-methyl-pentanoic acid ((S)-1-methylcarbamoyl-2-phenyl-ethyl)-amide | CHEMBL329002
Type:
Small organic molecule
Emp. Form.:
C21H33N3O3S
Mol. Mass.:
407.57
SMILES:
CNC(=O)[C@H](Cc1ccccc1)NC(=O)[C@H](CC(C)C)NC(=O)C(S)C(C)C
: