Target
Histone deacetylase 1
Ligand
BDBM50114819
Substrate
Meas. Tech.
ChEMBL_579921 (CHEMBL1056354)
IC50
1500±n/a nM
Citation
 Chen, YLi, HTang, WZhu, CJiang, YZou, JYu, QYou, Q 3D-QSAR studies of HDACs inhibitors using pharmacophore-based alignment. Eur J Med Chem 44:2868-76 (2009)  
Target
Name:
Histone deacetylase 1
Synonyms:
Cereblon/Histone deacetylase 1 HDAC1 Histone deacetylase 1 (HDAC1) RPD3L1
Type:
Enzyme
Mol. Mass.:
55090.27
Organism:
Homo sapiens (Human)
Description:
Q13547
Residue:
482
  
Inhibitor
Name:
BDBM50114819
Synonyms:
6-Oxo-6-phenyl-hexanoic acid hydroxyamide N-hydroxy-6-oxo-6-phenylhexanamide
Type:
Small organic molecule
Emp. Form.:
C12H15NO3
Mol. Mass.:
221.2524
SMILES:
ONC(=O)CCCCC(=O)c1ccccc1
: