Target
Histamine H3 receptor
Ligand
BDBM50296171
Substrate
Meas. Tech.
ChEMBL_579538 (CHEMBL1061547)
IC50
0.39±n/a nM
Citation
 Sasaki, TTakahashi, TNagase, TMizutani, TIto, SMitobe, YMiyamoto, YKanesaka, MYoshimoto, RTanaka, TTakenaga, NTokita, SSato, N Synthesis, structure-activity relationships, and biological profiles of a dihydrobenzoxathiin class of histamine H(3) receptor inverse agonists. Bioorg Med Chem Lett 19:4232-6 (2009)  
Target
Name:
Histamine H3 receptor
Synonyms:
G-protein coupled receptor 97 HH3R HRH3 Histamine H3 receptor (H3) Histamine receptor (H3 and H4)
Type:
G Protein-Coupled Receptor (GPCR)
Mol. Mass.:
48691.47
Organism:
Homo sapiens (Human)
Description:
Binding assays were using CHO cells stably expressing hH3R receptors.
Residue:
445
  
Inhibitor
Name:
BDBM50296171
Synonyms:
1-{3-[4-((2S,3S)-8-Methoxy-3-methyl-4,4-dioxo-3,4-dihydro-2H-4lambda*6*-benzo[1,4]oxathiin-2-yl)-phenoxy]-propyl}-pyrrolidine | CHEMBL560386
Type:
Small organic molecule
Emp. Form.:
C23H29NO5S
Mol. Mass.:
431.545
SMILES:
COc1cccc2c1O[C@H]([C@H](C)S2(=O)=O)c1ccc(OCCCN2CCCC2)cc1
: