Target
Nociceptin receptor
Ligand
BDBM50296914
Substrate
Meas. Tech.
ChEMBL_580796 (CHEMBL1059778)
IC50
1.4±n/a nM
Citation
 Sugimoto, YKobayashi, KAsai, MOhno, AYamada, KOzaki, SOhta, HOkamoto, O Synthesis and biological evaluation of imidazole derivatives as novel NOP/ORL1 receptor antagonists: exploration and optimization of alternative pyrazole structure. Bioorg Med Chem Lett 19:4611-6 (2009)  
Target
Name:
Nociceptin receptor
Synonyms:
KOR-3 Mu-type opioid receptor (Mu) Nociceptin Receptor (ORL1 Receptor) Nociceptin receptor (ORL-1) Nociceptin/Orphanin FQ, NOP receptor OPIATE ORL-1 OPRL1 protein ORL1 Opioid receptor like-1 Orphanin FQ receptor (ORL1) | P41146
Type:
G Protein-Coupled Receptor (GPCR)
Mol. Mass.:
40702.87
Organism:
Homo sapiens (Human)
Description:
P41146
Residue:
370
  
Inhibitor
Name:
BDBM50296914
Synonyms:
(1S,3R)-N-((2-(3-chloropyridin-2-yl)-5-isopropyl-1-(6-methylpyridin-3-yl)-1H-imidazol-4-yl)methyl)-3-fluorocyclopentanamine | CHEMBL561397
Type:
Small organic molecule
Emp. Form.:
C23H27ClFN5
Mol. Mass.:
427.945
SMILES:
CC(C)c1c(CN[C@H]2CC[C@@H](F)C2)nc(-c2ncccc2Cl)n1-c1ccc(C)nc1
: