Target
5-hydroxytryptamine receptor 2C
Ligand
BDBM50298335
Substrate
Meas. Tech.
ChEMBL_588489 (CHEMBL1040387)
IC50
589±n/a nM
Citation
 Ahmed, AChoo, HCho, YSPark, WKPae, AN Identification of novel serotonin 2C receptor ligands by sequential virtual screening. Bioorg Med Chem 17:4559-68 (2009)  
Target
Name:
5-hydroxytryptamine receptor 2C
Synonyms:
5-HT-1C 5-HT1C 5-HT2C-INI 5-HTR2C 5-hydroxytryptamine receptor 2C (5-HT-2C) 5HT-1C HTR1C Serotonin (5-HT3) receptor Serotonin Receptor 2C
Type:
G Protein-Coupled Receptor (GPCR)
Mol. Mass.:
51836.79
Organism:
Homo sapiens (Human)
Description:
P28335
Residue:
458
  
Inhibitor
Name:
BDBM50298335
Synonyms:
CHEMBL573553 | methyl 4-hydroxy-2-(piperidin-4-yl)pyrazolo[1,5-a][1,3,5]triazine-8-carboxylate
Type:
Small organic molecule
Emp. Form.:
C12H15N5O3
Mol. Mass.:
277.2792
SMILES:
COC(=O)c1cnn2c1nc([nH]c2=O)C1CCNCC1
: