Target
Urokinase-type plasminogen activator
Ligand
BDBM50301988
Substrate
Meas. Tech.
ChEMBL_599341 (CHEMBL1042862)
IC50
100±n/a nM
Citation
 West, CWAdler, MArnaiz, DChen, DChu, KGualtieri, GHo, EHuwe, CLight, DPhillips, GPulk, RSukovich, DWhitlow, MYuan, SBryant, J Identification of orally bioavailable, non-amidine inhibitors of Urokinase Plasminogen Activator (uPA). Bioorg Med Chem Lett 19:5712-5 (2009)  
Target
Name:
Urokinase-type plasminogen activator
Synonyms:
3.4.21.73 U-plasminogen activator Urokinase Urokinase-type plasminogen activator chain B Urokinase-type plasminogen activator short chain A uPA
Type:
Enzyme
Mol. Mass.:
48528.62
Organism:
Homo sapiens (Human)
Description:
P00749
Residue:
431
  
Inhibitor
Name:
BDBM50301988
Synonyms:
2-(6-(3'-(aminomethyl)biphenyl-3-yloxy)-3,5-difluoropyridin-2-yloxy)-4-(dimethylamino)benzoic acid | CHEMBL571393
Type:
Small organic molecule
Emp. Form.:
C27H23F2N3O4
Mol. Mass.:
491.486
SMILES:
CN(C)c1ccc(C(O)=O)c(Oc2nc(Oc3cccc(c3)-c3cccc(CN)c3)c(F)cc2F)c1
: