Target
Cytochrome P450 3A4
Ligand
BDBM50302903
Substrate
Meas. Tech.
ChEMBL_595638 (CHEMBL1038133)
IC50
16000±n/a nM
Citation
 Boezio, AABerry, LAlbrecht, BKBauer, DBellon, SFBode, CChen, AChoquette, DDussault, IFang, MHirai, SKaplan-Lefko, PLarrow, JFLin, MHLohman, JPotashman, MHQu, YRex, KSantostefano, MShah, KShimanovich, RSpringer, SKTeffera, YYang, YZhang, YHarmange, JC Discovery and optimization of potent and selective triazolopyridazine series of c-Met inhibitors. Bioorg Med Chem Lett 19:6307-12 (2009)  
Target
Name:
Cytochrome P450 3A4
Synonyms:
Albendazole monooxygenase CP3A4_HUMAN CYP3A4 CYPIIIA4 Cytochrome P450 3A4 (CYP3A4) Nifedipine oxidase Taurochenodeoxycholate 6-alpha-hydroxylase
Type:
Enzyme
Mol. Mass.:
57349.57
Organism:
Homo sapiens (Human)
Description:
Residue:
503
  
Inhibitor
Name:
BDBM50302903
Synonyms:
7-methoxy-N-((6-(3,4,5-trifluorophenyl)-[1,2,4]triazolo[4,3-b]pyridazin-3-yl)methyl)-1,5-naphthyridin-4-amine US9066954, 172
Type:
Small organic molecule
Emp. Form.:
C21H14F3N7O
Mol. Mass.:
437.3774
SMILES:
COc1cnc2c(NCc3nnc4ccc(nn34)-c3cc(F)c(F)c(F)c3)ccnc2c1
: