Target
Hepatocyte growth factor receptor
Ligand
BDBM50302903
Substrate
Meas. Tech.
ChEMBL_595636 (CHEMBL1038131)
IC50
7±n/a nM
Citation
 Boezio, AABerry, LAlbrecht, BKBauer, DBellon, SFBode, CChen, AChoquette, DDussault, IFang, MHirai, SKaplan-Lefko, PLarrow, JFLin, MHLohman, JPotashman, MHQu, YRex, KSantostefano, MShah, KShimanovich, RSpringer, SKTeffera, YYang, YZhang, YHarmange, JC Discovery and optimization of potent and selective triazolopyridazine series of c-Met inhibitors. Bioorg Med Chem Lett 19:6307-12 (2009)  
Target
Name:
Hepatocyte growth factor receptor
Synonyms:
Hepatocyte growth factor receptor Hepatocyte growth factor receptor (c-MET) MET Met proto-oncogene (hepatocyte growth factor receptor) Tyrosine-protein kinase Met (c-Met) c-Met kinase
Type:
Protein
Mol. Mass.:
155559.73
Organism:
Homo sapiens (Human)
Description:
P08581
Residue:
1390
  
Inhibitor
Name:
BDBM50302903
Synonyms:
7-methoxy-N-((6-(3,4,5-trifluorophenyl)-[1,2,4]triazolo[4,3-b]pyridazin-3-yl)methyl)-1,5-naphthyridin-4-amine US9066954, 172
Type:
Small organic molecule
Emp. Form.:
C21H14F3N7O
Mol. Mass.:
437.3774
SMILES:
COc1cnc2c(NCc3nnc4ccc(nn34)-c3cc(F)c(F)c(F)c3)ccnc2c1
: