Target
Prostaglandin E2 receptor EP3 subtype
Ligand
BDBM50303680
Substrate
Meas. Tech.
ChEMBL_596837 (CHEMBL1042648)
IC50
2.4±n/a nM
Citation
 Singh, JZeller, WZhou, NHategan, GMishra, RKPolozov, AYu, POnua, EZhang, JRamírez, JLSigthorsson, GThorsteinnsdottir, MKiselyov, ASZembower, DEAndrésson, TGurney, ME Structure-activity relationship studies leading to the identification of (2E)-3-[l-[(2,4-dichlorophenyl)methyl]-5-fluoro-3-methyl-lH-indol-7-yl]-N-[(4,5-dichloro-2-thienyl)sulfonyl]-2-propenamide (DG-041), a potent and selective prostanoid EP3 receptor antagonist, as a novel antiplatelet agent that J Med Chem 53:18-36 (2010)  
Target
Name:
Prostaglandin E2 receptor EP3 subtype
Synonyms:
PE2R3_HUMAN PGE2-R Prostaglandin E2 receptor Prostaglandin E2 receptor EP3 subtype (EP3) Prostaglandin E2 receptor EP3D subtype (EP3D) | Prostanoid EP3 receptor
Type:
Enzyme
Mol. Mass.:
43335.03
Organism:
Homo sapiens (Human)
Description:
P43115
Residue:
390
  
Inhibitor
Name:
BDBM50303680
Synonyms:
4,5-Dichlorothiophene-2-sulfonic Acid[3-(3-Naphthalen-2-ylmethyl-1H-indol-4-yl)propionyl]amide | CHEMBL567905
Type:
Small organic molecule
Emp. Form.:
C26H20Cl2N2O3S2
Mol. Mass.:
543.485
SMILES:
Clc1cc(sc1Cl)S(=O)(=O)NC(=O)CCc1cccc2[nH]cc(Cc3ccc4ccccc4c3)c12
: