Target
Prostaglandin E2 receptor EP3 subtype
Ligand
BDBM50303707
Substrate
Meas. Tech.
ChEMBL_596837 (CHEMBL1042648)
IC50
3.6±n/a nM
Citation
 Singh, JZeller, WZhou, NHategan, GMishra, RKPolozov, AYu, POnua, EZhang, JRamírez, JLSigthorsson, GThorsteinnsdottir, MKiselyov, ASZembower, DEAndrésson, TGurney, ME Structure-activity relationship studies leading to the identification of (2E)-3-[l-[(2,4-dichlorophenyl)methyl]-5-fluoro-3-methyl-lH-indol-7-yl]-N-[(4,5-dichloro-2-thienyl)sulfonyl]-2-propenamide (DG-041), a potent and selective prostanoid EP3 receptor antagonist, as a novel antiplatelet agent that J Med Chem 53:18-36 (2010)  
Target
Name:
Prostaglandin E2 receptor EP3 subtype
Synonyms:
PE2R3_HUMAN PGE2-R Prostaglandin E2 receptor Prostaglandin E2 receptor EP3 subtype (EP3) Prostaglandin E2 receptor EP3D subtype (EP3D) | Prostanoid EP3 receptor
Type:
Enzyme
Mol. Mass.:
43335.03
Organism:
Homo sapiens (Human)
Description:
P43115
Residue:
390
  
Inhibitor
Name:
BDBM50303707
Synonyms:
3,5-Difluoro-N-[(E)-3-(5-fluoro-1-imidazo[1,2-a]pyridin-2-ylmethyl-3-methyl-1H-indol-7-yl)acryloyl]benzenesulfonamide | CHEMBL566429
Type:
Small organic molecule
Emp. Form.:
C26H19F3N4O3S
Mol. Mass.:
524.514
SMILES:
Cc1cn(Cc2cn3ccccc3n2)c2c(\C=C\C(=O)NS(=O)(=O)c3cc(F)cc(F)c3)cc(F)cc12
: