Target
Prostaglandin E2 receptor EP3 subtype
Ligand
BDBM50303712
Substrate
Meas. Tech.
ChEMBL_596837 (CHEMBL1042648)
IC50
5.7±n/a nM
Citation
 Singh, JZeller, WZhou, NHategan, GMishra, RKPolozov, AYu, POnua, EZhang, JRamírez, JLSigthorsson, GThorsteinnsdottir, MKiselyov, ASZembower, DEAndrésson, TGurney, ME Structure-activity relationship studies leading to the identification of (2E)-3-[l-[(2,4-dichlorophenyl)methyl]-5-fluoro-3-methyl-lH-indol-7-yl]-N-[(4,5-dichloro-2-thienyl)sulfonyl]-2-propenamide (DG-041), a potent and selective prostanoid EP3 receptor antagonist, as a novel antiplatelet agent that J Med Chem 53:18-36 (2010)  
Target
Name:
Prostaglandin E2 receptor EP3 subtype
Synonyms:
PE2R3_HUMAN PGE2-R Prostaglandin E2 receptor Prostaglandin E2 receptor EP3 subtype (EP3) Prostaglandin E2 receptor EP3D subtype (EP3D) | Prostanoid EP3 receptor
Type:
Enzyme
Mol. Mass.:
43335.03
Organism:
Homo sapiens (Human)
Description:
P43115
Residue:
390
  
Inhibitor
Name:
BDBM50303712
Synonyms:
2,4,5-Trifluoro-N-{(E)-3-[5-fluoro-1-(3-methoxybenzyl)-3-methyl-1H-indol-7-yl]acryloyl}benzenesulfonamide CHEMBL480029
Type:
Small organic molecule
Emp. Form.:
C26H20F4N2O4S
Mol. Mass.:
532.507
SMILES:
COc1cccc(Cn2cc(C)c3cc(F)cc(\C=C\C(=O)NS(=O)(=O)c4cc(F)c(F)cc4F)c23)c1
: