Target
Acyl-CoA desaturase 1
Ligand
BDBM50306116
Substrate
Meas. Tech.
ChEMBL_606059 (CHEMBL1071958)
IC50
7±n/a nM
Citation
 Uto, YKiyotsuka, YUeno, YMiyazawa, YKurata, HOgata, TDeguchi, TYamada, MWatanabe, NKonishi, MKurikawa, NTakagi, TWakimoto, SKono, KOhsumi, J Novel spiropiperidine-based stearoyl-CoA desaturase-1 inhibitors: Identification of 1'-{6-[5-(pyridin-3-ylmethyl)-1,3,4-oxadiazol-2-yl]pyridazin-3-yl}-5-(trifluoromethyl)-3,4-dihydrospiro[chromene-2,4'-piperidine]. Bioorg Med Chem Lett 20:746-54 (2010)  
Target
Name:
Acyl-CoA desaturase 1
Synonyms:
ACOD1_MOUSE | Scd1
Type:
PROTEIN
Mol. Mass.:
41064.54
Organism:
Mus musculus
Description:
ChEMBL_1462109
Residue:
355
  
Inhibitor
Name:
BDBM50306116
Synonyms:
CHEMBL594289 | N-(2-hydroxy-2-phenylethyl)-6-(spiro[chroman-2,4'-piperidine]-1'-yl)pyridazine-3-carboxamide
Type:
Small organic molecule
Emp. Form.:
C26H28N4O3
Mol. Mass.:
444.5255
SMILES:
OC(CNC(=O)c1ccc(nn1)N1CCC2(CC1)CCc1ccccc1O2)c1ccccc1
: