Target
Tyrosine-protein phosphatase non-receptor type 11
Ligand
BDBM50308158
Substrate
Meas. Tech.
ChEMBL_610373 (CHEMBL1070012)
Ki
5200±n/a nM
Citation
 Zhang, XHe, YLiu, SYu, ZJiang, ZXYang, ZDong, YNabinger, SCWu, LGunawan, AMWang, LChan, RJZhang, ZY Salicylic acid based small molecule inhibitor for the oncogenic Src homology-2 domain containing protein tyrosine phosphatase-2 (SHP2). J Med Chem 53:2482-93 (2010)  
Target
Name:
Tyrosine-protein phosphatase non-receptor type 11
Synonyms:
3.1.3.48 PTP-1D PTP2C Protein Tyrosine Phosphatase PPN11/Shp2 Protein-Tyrosine Phosphatase SHP-2 Protein-tyrosine phosphatase 2C SH-PTP3 SHP2 Src homology phosphatase 2 (SHP-2) Tyrosine-protein phosphatase non-receptor type 11 (SHP-2) | Tyrosine-protein phosphatase non-receptor type 11 (SHP2)
Type:
Protein phosphatase
Mol. Mass.:
68443.59
Organism:
Homo sapiens (Human)
Description:
Q06124
Residue:
593
  
Inhibitor
Name:
BDBM50308158
Synonyms:
3-(1-(3-(Biphenyl-4-ylamino)-3-oxopropyl)-1H-1,2,3-triazol-4-yl)-6-hydroxy-1-methyl-2-phenyl-1H-indole-5-carboxylic Acid CHEMBL590043
Type:
Small organic molecule
Emp. Form.:
C33H27N5O4
Mol. Mass.:
557.5986
SMILES:
Cn1c(c(-c2cn(CCC(=O)Nc3ccc(cc3)-c3ccccc3)nn2)c2cc(C(O)=O)c(O)cc12)-c1ccccc1
: