Target
Prostaglandin E2 receptor EP3 subtype
Ligand
BDBM50311615
Substrate
Meas. Tech.
ChEMBL_618650 (CHEMBL1101699)
IC50
1±n/a nM
Citation
 Hategan, GPolozov, AMZeller, WCao, HMishra, RKKiselyov, ASRamirez, JHalldorsdottir, GAndrésson, TGurney, MESingh, J Heterocyclic 1,7-disubstituted indole sulfonamides are potent and selective human EP3 receptor antagonists. Bioorg Med Chem Lett 19:6797-800 (2009)  
Target
Name:
Prostaglandin E2 receptor EP3 subtype
Synonyms:
PE2R3_HUMAN PGE2-R Prostaglandin E2 receptor Prostaglandin E2 receptor EP3 subtype (EP3) Prostaglandin E2 receptor EP3D subtype (EP3D) | Prostanoid EP3 receptor
Type:
Enzyme
Mol. Mass.:
43335.03
Organism:
Homo sapiens (Human)
Description:
P43115
Residue:
390
  
Inhibitor
Name:
BDBM50311615
Synonyms:
4,5-dichloro-N-(5-(5-fluoro-3-methyl-1-(naphthalen-2-ylmethyl)-1H-indol-7-yl)isoxazol-3-yl)thiophene-2-sulfonamide | CHEMBL1081185
Type:
Small organic molecule
Emp. Form.:
C27H18Cl2FN3O3S2
Mol. Mass.:
586.485
SMILES:
Cc1cn(Cc2ccc3ccccc3c2)c2c(cc(F)cc12)-c1cc(NS(=O)(=O)c2cc(Cl)c(Cl)s2)no1
: