Target
Prostaglandin E2 receptor EP3 subtype
Ligand
BDBM50311622
Substrate
Meas. Tech.
ChEMBL_618650 (CHEMBL1101699)
IC50
4±n/a nM
Citation
 Hategan, GPolozov, AMZeller, WCao, HMishra, RKKiselyov, ASRamirez, JHalldorsdottir, GAndrésson, TGurney, MESingh, J Heterocyclic 1,7-disubstituted indole sulfonamides are potent and selective human EP3 receptor antagonists. Bioorg Med Chem Lett 19:6797-800 (2009)  
Target
Name:
Prostaglandin E2 receptor EP3 subtype
Synonyms:
PE2R3_HUMAN PGE2-R Prostaglandin E2 receptor Prostaglandin E2 receptor EP3 subtype (EP3) Prostaglandin E2 receptor EP3D subtype (EP3D) | Prostanoid EP3 receptor
Type:
Enzyme
Mol. Mass.:
43335.03
Organism:
Homo sapiens (Human)
Description:
P43115
Residue:
390
  
Inhibitor
Name:
BDBM50311622
Synonyms:
3,4-dichloro-N-(5-(1-(2,4-dichlorobenzyl)-5-fluoro-3-methyl-1H-indol-7-yl)-1,3,4-oxadiazol-2-yl)benzenesulfonamide | CHEMBL1081724
Type:
Small organic molecule
Emp. Form.:
C24H15Cl4FN4O3S
Mol. Mass.:
600.276
SMILES:
Cc1cn(Cc2ccc(Cl)cc2Cl)c2c(cc(F)cc12)-c1nnc(NS(=O)(=O)c2ccc(Cl)c(Cl)c2)o1
: