Target
Cholesteryl ester transfer protein
Ligand
BDBM50312705
Substrate
Meas. Tech.
ChEMBL_615620 (CHEMBL1104194)
IC50
500±n/a nM
Citation
 Schmeck, CGielen-Haertwig, HVakalopoulos, ABischoff, HLi, VWirtz, GWeber, O Novel tetrahydrochinoline derived CETP inhibitors. Bioorg Med Chem Lett 20:1740-3 (2010)  
Target
Name:
Cholesteryl ester transfer protein
Synonyms:
CETP Cholesteryl ester transfer protein (CETP) | Lipid transfer protein I
Type:
Enzyme
Mol. Mass.:
54751.53
Organism:
Homo sapiens (Human)
Description:
P11597
Residue:
493
  
Inhibitor
Name:
BDBM50312705
Synonyms:
(S)-benzyl 4-(2-cyclopentyl-5-hydroxy-7,7-dimethyl-3-(4-(trifluoromethyl)benzoyl)-5,6,7,8-tetrahydroquinolin-4-yl)piperidine-1-carboxylate | CHEMBL1076557
Type:
Small organic molecule
Emp. Form.:
C37H41F3N2O4
Mol. Mass.:
634.7276
SMILES:
CC1(C)C[C@H](O)c2c(C1)nc(C1CCCC1)c(C(=O)c1ccc(cc1)C(F)(F)F)c2C1CCN(CC1)C(=O)OCc1ccccc1
: