Target
Cholesteryl ester transfer protein
Ligand
BDBM50312710
Substrate
Meas. Tech.
ChEMBL_615620 (CHEMBL1104194)
IC50
100±n/a nM
Citation
 Schmeck, CGielen-Haertwig, HVakalopoulos, ABischoff, HLi, VWirtz, GWeber, O Novel tetrahydrochinoline derived CETP inhibitors. Bioorg Med Chem Lett 20:1740-3 (2010)  
Target
Name:
Cholesteryl ester transfer protein
Synonyms:
CETP Cholesteryl ester transfer protein (CETP) | Lipid transfer protein I
Type:
Enzyme
Mol. Mass.:
54751.53
Organism:
Homo sapiens (Human)
Description:
P11597
Residue:
493
  
Inhibitor
Name:
BDBM50312710
Synonyms:
CHEMBL1080750 | trans-4-cyclohexyl-2-cyclopentyl-3-(hydroxy(4-(trifluoromethyl)phenyl)methyl)-7,7-dimethyl-5,6,7,8-tetrahydroquinolin-5-ol
Type:
Small organic molecule
Emp. Form.:
C30H38F3NO2
Mol. Mass.:
501.6234
SMILES:
CC1(C)C[C@H](O)c2c(C1)nc(C1CCCC1)c([C@@H](O)c1ccc(cc1)C(F)(F)F)c2C1CCCCC1
: