Target
Cholesteryl ester transfer protein
Ligand
BDBM50312713
Substrate
Meas. Tech.
ChEMBL_615620 (CHEMBL1104194)
IC50
30±n/a nM
Citation
 Schmeck, CGielen-Haertwig, HVakalopoulos, ABischoff, HLi, VWirtz, GWeber, O Novel tetrahydrochinoline derived CETP inhibitors. Bioorg Med Chem Lett 20:1740-3 (2010)  
Target
Name:
Cholesteryl ester transfer protein
Synonyms:
CETP Cholesteryl ester transfer protein (CETP) | Lipid transfer protein I
Type:
Enzyme
Mol. Mass.:
54751.53
Organism:
Homo sapiens (Human)
Description:
P11597
Residue:
493
  
Inhibitor
Name:
BDBM50312713
Synonyms:
(S)-4-cyclohexyl-3-((S)-fluoro(4-(trifluoromethyl)phenyl)methyl)-2-isopropyl-7,7-dimethyl-5,6,7,8-tetrahydroquinolin-5-ol | CHEMBL1081287
Type:
Small organic molecule
Emp. Form.:
C28H35F4NO
Mol. Mass.:
477.5772
SMILES:
CC(C)c1nc2CC(C)(C)C[C@H](O)c2c(C2CCCCC2)c1[C@@H](F)c1ccc(cc1)C(F)(F)F
: