Target
Cholesteryl ester transfer protein
Ligand
BDBM50312722
Substrate
Meas. Tech.
ChEMBL_615620 (CHEMBL1104194)
IC50
600±n/a nM
Citation
 Schmeck, CGielen-Haertwig, HVakalopoulos, ABischoff, HLi, VWirtz, GWeber, O Novel tetrahydrochinoline derived CETP inhibitors. Bioorg Med Chem Lett 20:1740-3 (2010)  
Target
Name:
Cholesteryl ester transfer protein
Synonyms:
CETP Cholesteryl ester transfer protein (CETP) | Lipid transfer protein I
Type:
Enzyme
Mol. Mass.:
54751.53
Organism:
Homo sapiens (Human)
Description:
P11597
Residue:
493
  
Inhibitor
Name:
BDBM50312722
Synonyms:
(S)-(2'-cyclopentyl-5'-hydroxy-4'-propyl-6',8'-dihydro-5'H-spiro[cyclobutane-1,7'-quinoline]-3'-yl)(4-(trifluoromethyl)phenyl)methanone | CHEMBL1088039
Type:
Small organic molecule
Emp. Form.:
C28H32F3NO2
Mol. Mass.:
471.5544
SMILES:
CCCc1c2[C@@H](O)CC3(CCC3)Cc2nc(C2CCCC2)c1C(=O)c1ccc(cc1)C(F)(F)F
: