Target
Cholesteryl ester transfer protein
Ligand
BDBM50312733
Substrate
Meas. Tech.
ChEMBL_615620 (CHEMBL1104194)
IC50
2000±n/a nM
Citation
 Schmeck, CGielen-Haertwig, HVakalopoulos, ABischoff, HLi, VWirtz, GWeber, O Novel tetrahydrochinoline derived CETP inhibitors. Bioorg Med Chem Lett 20:1740-3 (2010)  
Target
Name:
Cholesteryl ester transfer protein
Synonyms:
CETP Cholesteryl ester transfer protein (CETP) | Lipid transfer protein I
Type:
Enzyme
Mol. Mass.:
54751.53
Organism:
Homo sapiens (Human)
Description:
P11597
Residue:
493
  
Inhibitor
Name:
BDBM50312733
Synonyms:
((5S)-4-sec-butyl-2-cyclopentyl-5-hydroxy-7,7-dimethyl-5,6,7,8-tetrahydroquinolin-3-yl)(4-(trifluoromethyl)phenyl)methanone | CHEMBL1080709
Type:
Small organic molecule
Emp. Form.:
C28H34F3NO2
Mol. Mass.:
473.5703
SMILES:
CCC(C)c1c2[C@@H](O)CC(C)(C)Cc2nc(C2CCCC2)c1C(=O)c1ccc(cc1)C(F)(F)F
: