Target
Cholesteryl ester transfer protein
Ligand
BDBM50312734
Substrate
Meas. Tech.
ChEMBL_615620 (CHEMBL1104194)
IC50
3000±n/a nM
Citation
 Schmeck, CGielen-Haertwig, HVakalopoulos, ABischoff, HLi, VWirtz, GWeber, O Novel tetrahydrochinoline derived CETP inhibitors. Bioorg Med Chem Lett 20:1740-3 (2010)  
Target
Name:
Cholesteryl ester transfer protein
Synonyms:
CETP Cholesteryl ester transfer protein (CETP) | Lipid transfer protein I
Type:
Enzyme
Mol. Mass.:
54751.53
Organism:
Homo sapiens (Human)
Description:
P11597
Residue:
493
  
Inhibitor
Name:
BDBM50312734
Synonyms:
(S)-(2-cyclopentyl-5-hydroxy-7,7-dimethyl-4-(2,2,2-trifluoroethyl)-5,6,7,8-tetrahydroquinolin-3-yl)(4-(trifluoromethyl)phenyl)methanone | CHEMBL1080710
Type:
Small organic molecule
Emp. Form.:
C26H27F6NO2
Mol. Mass.:
499.4885
SMILES:
CC1(C)C[C@H](O)c2c(C1)nc(C1CCCC1)c(C(=O)c1ccc(cc1)C(F)(F)F)c2CC(F)(F)F
: