Target
Cholesteryl ester transfer protein
Ligand
BDBM50312715
Substrate
Meas. Tech.
ChEMBL_615619 (CHEMBL1104193)
IC50
33±n/a nM
Citation
 Schmeck, CGielen-Haertwig, HVakalopoulos, ABischoff, HLi, VWirtz, GWeber, O Novel tetrahydrochinoline derived CETP inhibitors. Bioorg Med Chem Lett 20:1740-3 (2010)  
Target
Name:
Cholesteryl ester transfer protein
Synonyms:
CETP Cholesteryl ester transfer protein (CETP) | Lipid transfer protein I
Type:
Enzyme
Mol. Mass.:
54751.53
Organism:
Homo sapiens (Human)
Description:
P11597
Residue:
493
  
Inhibitor
Name:
BDBM50312715
Synonyms:
(S)-4'-cyclohexyl-3'-((S)-fluoro(4-(trifluoromethyl)phenyl)methyl)-2'-isopropyl-6',8'-dihydro-5'H-spiro[cyclobutane-1,7'-quinolin]-5'-ol | CHEMBL1081450
Type:
Small organic molecule
Emp. Form.:
C29H35F4NO
Mol. Mass.:
489.5879
SMILES:
CC(C)c1nc2CC3(CCC3)C[C@H](O)c2c(C2CCCCC2)c1[C@@H](F)c1ccc(cc1)C(F)(F)F
: