Target
Neuropilin-1
Ligand
BDBM50313486
Substrate
Meas. Tech.
ChEMBL_617636 (CHEMBL1101245)
IC50
17000±n/a nM
Citation
 Jarvis, AAllerston, CKJia, HHerzog, BGarza-Garcia, AWinfield, NEllard, KAqil, RLynch, RChapman, CHartzoulakis, BNally, JStewart, MCheng, LMenon, MTickner, MDjordjevic, SDriscoll, PCZachary, ISelwood, DL Small molecule inhibitors of the neuropilin-1 vascular endothelial growth factor A (VEGF-A) interaction. J Med Chem 53:2215-26 (2010)  
Target
Name:
Neuropilin-1
Synonyms:
Chain A, Crystal Structure Of The B1b2 Domains From Human Neuropilin- 1 NRP1 Neuropilin-1 | VEGF165R
Type:
PROTEIN
Mol. Mass.:
103122.09
Organism:
Homo sapiens (Human)
Description:
ChEMBL_617636
Residue:
923
  
Inhibitor
Name:
BDBM50313486
Synonyms:
(S)-2-{[3-(2-Amino-benzenesulfonylamino)-thiophene-2-carbonyl]-amino}-5-guanidinopentanoic acid | CHEMBL1078851
Type:
Small organic molecule
Emp. Form.:
C17H22N6O5S2
Mol. Mass.:
454.524
SMILES:
[#7]\[#6](-[#7])=[#7]\[#6]-[#6]-[#6]-[#6@H](-[#7]-[#6](=O)-c1sccc1-[#7]S(=O)(=O)c1ccccc1-[#7])-[#6](-[#8])=O
: