Target
Hydroxycarboxylic acid receptor 2
Ligand
BDBM23533
Substrate
Meas. Tech.
ChEMBL_615510 (CHEMBL1105988)
Ki
120±n/a nM
Citation
 Shen, HCDing, FXRaghavan, SDeng, QLuell, SForrest, MJCarballo-Jane, EWilsie, LCKrsmanovic, MLTaggart, AKWu, KKWu, TJCheng, KRen, NCai, TQChen, QWang, JWolff, MSTong, XHolt, TGWaters, MGHammond, MLTata, JRColletti, SL Discovery of a biaryl cyclohexene carboxylic acid (MK-6892): a potent and selective high affinity niacin receptor full agonist with reduced flushing profiles in animals as a preclinical candidate. J Med Chem 53:2666-70 (2010)  
Target
Name:
Hydroxycarboxylic acid receptor 2
Synonyms:
G-protein coupled receptor 109A GPR109A HCAR2 HM74A NIACR1 Nicotinic acid receptor 1
Type:
G Protein-Coupled Receptor (GPCR)
Mol. Mass.:
41868.22
Organism:
Homo sapiens (Human)
Description:
Membranes from CHO cells expressing the recombinant human GPR109A were used in competition binding assay.
Residue:
363
  
Inhibitor
Name:
BDBM23533
Synonyms:
2-{3-[3-(5-hydroxypyridin-2-yl)-1,2,4-oxadiazol-5-yl]propanamido}benzoic acid | Biaryl Anthranilide Analogue, 2o
Type:
Small organic molecule
Emp. Form.:
C17H14N4O5
Mol. Mass.:
354.3169
SMILES:
OC(=O)c1ccccc1NC(=O)CCc1nc(no1)-c1ccc(O)cn1
: