Target
Poly [ADP-ribose] polymerase 1
Ligand
BDBM50315794
Substrate
Meas. Tech.
ChEMBL_625251 (CHEMBL1106194)
Ki
6±n/a nM
Citation
 Penning, TDZhu, GDGong, JThomas, SGandhi, VBLiu, XShi, YKlinghofer, VJohnson, EFPark, CHFry, EHDonawho, CKFrost, DJBuchanan, FGBukofzer, GTRodriguez, LEBontcheva-Diaz, VBouska, JJOsterling, DJOlson, AMMarsh, KCLuo, YGiranda, VL Optimization of phenyl-substituted benzimidazole carboxamide poly(ADP-ribose) polymerase inhibitors: identification of (S)-2-(2-fluoro-4-(pyrrolidin-2-yl)phenyl)-1H-benzimidazole-4-carboxamide (A-966492), a highly potent and efficacious inhibitor. J Med Chem 53:3142-53 (2010)  
Target
Name:
Poly [ADP-ribose] polymerase 1
Synonyms:
(ARTD1 or PARP1) 2.4.2.30 ADPRT ARTD1 Human diphtheria toxin-like ADP-ribosyltransferase (ARTD1 or PARP1) NT-PARP-1 PARP1 PPOL Poly [ADP-ribose] polymerase 1 (PARP) Poly [ADP-ribose] polymerase 1 (PARP1) Poly [ADP-ribose] polymerase 1, 28-kDa form Poly [ADP-ribose] polymerase 1, processed C-terminus Poly [ADP-ribose] polymerase-1 Poly(ADP-ribose) polymerase-1 (ARTD1/PARP1) Protein poly-ADP-ribosyltransferase PARP1 | Synonyms=ADPRT
Type:
Mol. Mass.:
113114.22
Organism:
Homo sapiens (Human)
Description:
P09874
Residue:
1014
  
Inhibitor
Name:
BDBM50315794
Synonyms:
2-(2-Fluoro-4-piperidin-2-ylphenyl)-1H-benzimidazole-4-carboxamide | CHEMBL1089101
Type:
Small organic molecule
Emp. Form.:
C19H19FN4O
Mol. Mass.:
338.3788
SMILES:
NC(=O)c1cccc2[nH]c(nc12)-c1ccc(cc1F)C1CCCCN1
: