Target
cAMP-specific 3',5'-cyclic phosphodiesterase 4B
Ligand
BDBM50317602
Substrate
Meas. Tech.
ChEMBL_632605 (CHEMBL1109006)
IC50
>30000±n/a nM
Citation
 Govek, SPOshiro, GAnzola, JVBeauregard, CChen, JCoyle, ARGamache, DAHellberg, MRHsien, JNLerch, JMLiao, JCMalecha, JWStaszewski, LMThomas, DJYanni, JMNoble, SAShiau, AK Water-soluble PDE4 inhibitors for the treatment of dry eye. Bioorg Med Chem Lett 20:2928-32 (2010)  
Target
Name:
cAMP-specific 3',5'-cyclic phosphodiesterase 4B
Synonyms:
3',5'-cyclic phosphodiesterase Isoform PDE4B1 PDE4B PDE4B_HUMAN Phosphodiesterase 4B (PDE4B) Phosphodiesterase Type 4 (PDE4B)
Type:
Protein
Mol. Mass.:
83318.87
Organism:
Homo sapiens (Human)
Description:
Q07343
Residue:
736
  
Inhibitor
Name:
BDBM50317602
Synonyms:
3,5-dichloro-N-(8-(cyclopentyloxy)-7-methoxychroman-4-yl)pyridin-4-amine | CHEMBL1098503
Type:
Small organic molecule
Emp. Form.:
C20H22Cl2N2O3
Mol. Mass.:
409.306
SMILES:
COc1ccc2C(CCOc2c1OC1CCCC1)Nc1c(Cl)cncc1Cl
: