Target
cAMP-specific 3',5'-cyclic phosphodiesterase 4B
Ligand
BDBM50317612
Substrate
Meas. Tech.
ChEMBL_632605 (CHEMBL1109006)
IC50
45±n/a nM
Citation
 Govek, SPOshiro, GAnzola, JVBeauregard, CChen, JCoyle, ARGamache, DAHellberg, MRHsien, JNLerch, JMLiao, JCMalecha, JWStaszewski, LMThomas, DJYanni, JMNoble, SAShiau, AK Water-soluble PDE4 inhibitors for the treatment of dry eye. Bioorg Med Chem Lett 20:2928-32 (2010)  
Target
Name:
cAMP-specific 3',5'-cyclic phosphodiesterase 4B
Synonyms:
3',5'-cyclic phosphodiesterase Isoform PDE4B1 PDE4B PDE4B_HUMAN Phosphodiesterase 4B (PDE4B) Phosphodiesterase Type 4 (PDE4B)
Type:
Protein
Mol. Mass.:
83318.87
Organism:
Homo sapiens (Human)
Description:
Q07343
Residue:
736
  
Inhibitor
Name:
BDBM50317612
Synonyms:
4-(3,5-dichloropyridin-4-ylamino)-8-(4-(dimethylamino)butoxy)-7-methoxy-2H-chromen-2-one | CHEMBL1095225
Type:
Small organic molecule
Emp. Form.:
C21H23Cl2N3O4
Mol. Mass.:
452.331
SMILES:
COc1ccc2c(Nc3c(Cl)cncc3Cl)cc(=O)oc2c1OCCCCN(C)C
: