Target
Alpha-2A adrenergic receptor
Ligand
BDBM50320446
Substrate
Meas. Tech.
ChEMBL_634134 (CHEMBL1119141)
Ki
1.6±n/a nM
Citation
 Prabhakaran, JMajo, VJMilak, MSMali, PSavenkova, LMann, JJParsey, RVKumar, JS Synthesis and in vivo evaluation of [11C]MPTQ: a potential PET tracer for alpha2A-adrenergic receptors. Bioorg Med Chem Lett 20:3654-7 (2010)  
Target
Name:
Alpha-2A adrenergic receptor
Synonyms:
ADA2A_HUMAN ADRA2R Adrenergic alpha2A Alpha-2 adrenergic receptor subtype C10 Alpha-2A adrenoreceptor alpha-2A adrenergic receptor [Homo sapiens]
Type:
Enzyme
Mol. Mass.:
48979.91
Organism:
Homo sapiens (Human)
Description:
P08913
Residue:
465
  
Inhibitor
Name:
BDBM50320446
Synonyms:
CHEMBL1085510 | [N-methyl]5-methyl-3-[4-(3-phenylallyl)-piperazin-1-ylmethyl]-3,3a,4,5-tetrahydroisoxazolo[4,3-c]quinoline
Type:
Small organic molecule
Emp. Form.:
C25H30N4O
Mol. Mass.:
402.5319
SMILES:
CN1CC2[C@H](CN3CCN(C\C=C\c4ccccc4)CC3)ON=C2c2ccccc12
: