Target
Adenosine receptor A2b
Ligand
BDBM50086176
Substrate
Meas. Tech.
ChEMBL_644535 (CHEMBL1211412)
Ki
9.88±n/a nM
Citation
 Cheng, FXu, ZLiu, GTang, Y Insights into binding modes of adenosine A(2B) antagonists with ligand-based and receptor-based methods. Eur J Med Chem 45:3459-71 (2010)  
Target
Name:
Adenosine receptor A2b
Synonyms:
AA2BR_HUMAN ADORA2B Adenosine receptors A2b | Adenosine receptors; A2a & A2b
Type:
G Protein-Coupled Receptor (GPCR)
Mol. Mass.:
36341.22
Organism:
Homo sapiens (Human)
Description:
Residue:
332
  
Inhibitor
Name:
BDBM50086176
Synonyms:
CHEMBL275149 N,N-dibenzyl-2-(4-(2,6-dioxo-1,3-dipropyl-2,3,6,7-tetrahydro-1H-purin-8-yl)phenoxy)acetamide
Type:
Small organic molecule
Emp. Form.:
C33H35N5O4
Mol. Mass.:
565.6621
SMILES:
CCCn1c2nc([nH]c2c(=O)n(CCC)c1=O)-c1ccc(OCC(=O)N(Cc2ccccc2)Cc2ccccc2)cc1
: