Target
Fibroblast growth factor receptor 1
Ligand
BDBM50279080
Substrate
Meas. Tech.
ChEMBL_655038 (CHEMBL1244082)
IC50
69±n/a nM
Citation
 Hilberg, FRoth, GJKrssak, MKautschitsch, SSommergruber, WTontsch-Grunt, UGarin-Chesa, PBader, GZoephel, AQuant, JHeckel, ARettig, WJ BIBF 1120: triple angiokinase inhibitor with sustained receptor blockade and good antitumor efficacy. Cancer Res 68:4774-82 (2008)  
Target
Name:
Fibroblast growth factor receptor 1
Synonyms:
BFGFR Basic fibroblast growth factor receptor 1 (FGFR1) CEK FGFR-1 FGFR-1, (FL) FGFR1_HUMAN FLT2 Fibroblast growth factor receptor 1 (FGFR-1) Fms-like tyrosine kinase 2 N-sam bFGF-R | c-fgr
Type:
Receptor
Mol. Mass.:
91861.70
Organism:
Homo sapiens (Human)
Description:
P11362
Residue:
822
  
Inhibitor
Name:
BDBM50279080
Synonyms:
(Z)-3-[(4-{Methyl-[2-(4-methylpiperazin-1-yl)acetyl]amino}-phenylamino)-methylene]-2-oxo-2,3-dihydro-1H-indole-6-carboxylicAcid Methyl Ester methyl (3Z)-3-{[(4-{methyl[(4-methylpiperazin-1-yl)acetyl]amino}phenyl)amino](phenyl)methylidene}-2-oxo-2,3-dihydro-1H-indole-6-carboxylate
Type:
Small organic molecule
Emp. Form.:
C31H33N5O4
Mol. Mass.:
539.6248
SMILES:
COC(=O)c1ccc2C(C(=Nc3ccc(cc3)N(C)C(=O)CN3CCN(C)CC3)c3ccccc3)C(=O)Nc2c1
: