Target
Cyclin-dependent kinase 2
Ligand
BDBM50279080
Substrate
Meas. Tech.
ChEMBL_655049 (CHEMBL1244093)
IC50
>10000±n/a nM
Citation
 Hilberg, FRoth, GJKrssak, MKautschitsch, SSommergruber, WTontsch-Grunt, UGarin-Chesa, PBader, GZoephel, AQuant, JHeckel, ARettig, WJ BIBF 1120: triple angiokinase inhibitor with sustained receptor blockade and good antitumor efficacy. Cancer Res 68:4774-82 (2008)  
Target
Name:
Cyclin-dependent kinase 2
Synonyms:
CDK2 CDK2_HUMAN Cell division protein kinase 2 Protein cereblon/Cyclin-dependent kinase 2 | p33 protein kinase
Type:
Enzyme Subunit
Mol. Mass.:
33938.17
Organism:
Homo sapiens (Human)
Description:
P24941
Residue:
298
  
Inhibitor
Name:
BDBM50279080
Synonyms:
(Z)-3-[(4-{Methyl-[2-(4-methylpiperazin-1-yl)acetyl]amino}-phenylamino)-methylene]-2-oxo-2,3-dihydro-1H-indole-6-carboxylicAcid Methyl Ester methyl (3Z)-3-{[(4-{methyl[(4-methylpiperazin-1-yl)acetyl]amino}phenyl)amino](phenyl)methylidene}-2-oxo-2,3-dihydro-1H-indole-6-carboxylate
Type:
Small organic molecule
Emp. Form.:
C31H33N5O4
Mol. Mass.:
539.6248
SMILES:
COC(=O)c1ccc2C(C(=Nc3ccc(cc3)N(C)C(=O)CN3CCN(C)CC3)c3ccccc3)C(=O)Nc2c1
: