Target
Cyclin-dependent kinase 4/G1/S-specific cyclin-D1
Ligand
BDBM50330281
Substrate
Meas. Tech.
ChEMBL_676328 (CHEMBL1273629)
IC50
9±n/a nM
Citation
 Cho, YSBorland, MBrain, CChen, CHCheng, HChopra, RChung, KGroarke, JHe, GHou, YKim, SKovats, SLu, YO'Reilly, MShen, JSmith, TTrakshel, GVögtle, MXu, MXu, MSung, MJ 4-(Pyrazol-4-yl)-pyrimidines as selective inhibitors of cyclin-dependent kinase 4/6. J Med Chem 53:7938-57 (2010)  
Target
Name:
Cyclin-dependent kinase 4/G1/S-specific cyclin-D1
Synonyms:
CDK4/CycD CDK4/Cyclin D1 Cyclin-Dependent Kinase 4 (CDK4) Cyclin-dependent kinase 4/G1/S-specific cyclin D1 | Cyclin-dependent kinase 4/cyclin D1
Type:
Protein Complex
Mol. Mass.:
Description:
CDK4/D1 complexes were purified from insect cells co-infected with baculovirus vectors containing each of the components.
Components:
This complex has 2 components.
Component 1
Name:
Cyclin-dependent kinase 4
Synonyms:
CDK4 Cell division protein kinase 4 PSK-J3
Type:
Enzyme Subunit
Mol. Mass.:
33731.96
Organism:
Homo sapiens (Human)
Description:
P11802
Residue:
303
  
Component 2
Name:
G1/S-specific cyclin-D1
Synonyms:
B-cell lymphoma 1 protein BCL-1 oncogene CCND1 PRAD1 | PRAD1 oncogene
Type:
Enzyme Subunit
Mol. Mass.:
33717.70
Organism:
Homo sapiens (Human)
Description:
Residue:
295
  
Inhibitor
Name:
BDBM50330281
Synonyms:
CHEMBL1271899 | {4-[5-Chloro-3-isopropyl-1-(2-trimethylsilanyl-ethoxymethyl)-1H-pyrazol-4-yl]-pyrimidin-2-yl}-[5-(4-methyl-piperazin-1-yl)-pyridin-2-yl]-amine
Type:
Small organic molecule
Emp. Form.:
C20H25ClN8
Mol. Mass.:
412.919
SMILES:
CC(C)c1n[nH]c(Cl)c1-c1ccnc(Nc2ccc(cn2)N2CCN(C)CC2)n1
: