Target
Cyclin-dependent kinase 4
Ligand
BDBM50330262
Substrate
Meas. Tech.
ChEMBL_676334 (CHEMBL1273635)
IC50
468±n/a nM
Citation
 Cho, YSBorland, MBrain, CChen, CHCheng, HChopra, RChung, KGroarke, JHe, GHou, YKim, SKovats, SLu, YO'Reilly, MShen, JSmith, TTrakshel, GVögtle, MXu, MXu, MSung, MJ 4-(Pyrazol-4-yl)-pyrimidines as selective inhibitors of cyclin-dependent kinase 4/6. J Med Chem 53:7938-57 (2010)  
Target
Name:
Cyclin-dependent kinase 4
Synonyms:
CDK4 Cell division protein kinase 4 PSK-J3
Type:
Enzyme Subunit
Mol. Mass.:
33731.96
Organism:
Homo sapiens (Human)
Description:
P11802
Residue:
303
  
Inhibitor
Name:
BDBM50330262
Synonyms:
CHEMBL1272171 | N*6'*-[4-(5-Isopropyl-3-trifluoromethyl-1H-pyrazol-4-yl)-pyrimidin-2-yl]-N*4*,N*4*-dimethyl-3,4,5,6-tetrahydro-2H-[1,3']-bipyridinyl-4,6'-diamine
Type:
Small organic molecule
Emp. Form.:
C23H29F3N8
Mol. Mass.:
474.5252
SMILES:
CC(C)c1[nH]nc(c1-c1ccnc(Nc2ccc(cn2)N2CCC(CC2)N(C)C)n1)C(F)(F)F
: