Target
Cyclin-dependent kinase 4
Ligand
BDBM50330261
Substrate
Meas. Tech.
ChEMBL_676334 (CHEMBL1273635)
IC50
324±n/a nM
Citation
 Cho, YSBorland, MBrain, CChen, CHCheng, HChopra, RChung, KGroarke, JHe, GHou, YKim, SKovats, SLu, YO'Reilly, MShen, JSmith, TTrakshel, GVögtle, MXu, MXu, MSung, MJ 4-(Pyrazol-4-yl)-pyrimidines as selective inhibitors of cyclin-dependent kinase 4/6. J Med Chem 53:7938-57 (2010)  
Target
Name:
Cyclin-dependent kinase 4
Synonyms:
CDK4 Cell division protein kinase 4 PSK-J3
Type:
Enzyme Subunit
Mol. Mass.:
33731.96
Organism:
Homo sapiens (Human)
Description:
P11802
Residue:
303
  
Inhibitor
Name:
BDBM50330261
Synonyms:
4-(5-Chloro-3-isopropyl-1H-pyrazol-4-yl)-N-(5-(4-(dimethylamino)piperidin-1-yl)pyridin-2-yl)pyrimidin-2-amine | CHEMBL1272116
Type:
Small organic molecule
Emp. Form.:
C22H29ClN8
Mol. Mass.:
440.972
SMILES:
CC(C)c1n[nH]c(Cl)c1-c1ccnc(Nc2ccc(cn2)N2CCC(CC2)N(C)C)n1
: