Target
Potassium voltage-gated channel subfamily H member 2
Ligand
BDBM50418110
Substrate
Meas. Tech.
ChEMBL_739892 (CHEMBL1762952)
Ki
251.19±n/a nM
Citation
 Ratcliffe, PAdam, JMBaker, JBursi, RCampbell, RClark, JKCottney, JEDeehan, MEasson, AMEcker, DEdwards, DEpemolu, OEvans, LFields, RFrancis, SHarradine, PJeremiah, FKiyoi, TMcArthur, DMorrison, APassier, PPick, JSchnabel, PGSchulz, JSteinbrede, HWalker, GWestwood, PWishart, Gde Haes, JU Design, synthesis and structure-activity relationships of (indo-3-yl) heterocyclic derivatives as agonists of the CB1 receptor. Discovery of a clinical candidate. Bioorg Med Chem Lett 21:2541-6 (2011)  
Target
Name:
Potassium voltage-gated channel subfamily H member 2
Synonyms:
1,3-beta-glucan synthase component GLS2 ERG Eag-related protein 1 Ether-a-go-go-related gene (HERG) Ether-a-go-go-related gene potassium channel 1 Ether-a-go-go-related gene potassium channel 1 (hERG1) Ether-a-go-go-related protein 1 H-ERG KCNH2 Potassium voltage-gated channel subfamily H member 2 (hERG) Voltage-gated potassium channel subunit Kv11.1 hERG Potassium Channel 1 | putative potassium channel subunit
Type:
Multi-pass membrane protein
Mol. Mass.:
126672.65
Organism:
Homo sapiens (Human)
Description:
Q12809
Residue:
1159
  
Inhibitor
Name:
BDBM50418110
Synonyms:
CHEMBL1762804
Type:
Small organic molecule
Emp. Form.:
C23H30ClN3OS
Mol. Mass.:
432.022
SMILES:
COCCN(C)Cc1csc(n1)-c1cn(CC2CCCCC2)c2c(Cl)cccc12
: