Target
11-beta-hydroxysteroid dehydrogenase 1
Ligand
BDBM50340394
Substrate
Meas. Tech.
ChEMBL_740939 (CHEMBL1764083)
IC50
1.2±n/a nM
Citation
 Maletic, MLeeman, ASzymonifka, MMundt, SSZokian, HJShah, KDragovic, JLyons, KThieringer, RVosatka, AHBalkovec, JWaddell, ST Bicyclo[2.2.2]octyltriazole inhibitors of 11β-hydoxysteroid dehydrogenase type 1. Pharmacological agents for the treatment of metabolic syndrome. Bioorg Med Chem Lett 21:2568-72 (2011)  
Target
Name:
11-beta-hydroxysteroid dehydrogenase 1
Synonyms:
11-DH 11-beta-Hydroxysteroid Dehydrogenase 1 (11-beta-HSD1) 11-beta-hydroxysteroid dehydrogenase 1 (11HSD1) Corticosteroid 11-beta-dehydrogenase isozyme 1 (11-beta-HSD-1) Corticosteroid 11-beta-dehydrogenase isozyme 1 (11beta-HSD1) HSD11 HSD11L | SDR26C1
Type:
Enzyme
Mol. Mass.:
32409.16
Organism:
Homo sapiens (Human)
Description:
P28845
Residue:
292
  
Inhibitor
Name:
BDBM50340394
Synonyms:
5-(4-(4-methyl-5-(2-(trifluoromethyl)phenyl)-4H-1,2,4-triazol-3-yl)bicyclo[2.2.2]octan-1-yl)pentan-2-one | CHEMBL1761137
Type:
Small organic molecule
Emp. Form.:
C23H28F3N3O
Mol. Mass.:
419.4831
SMILES:
CC(=O)CCCC12CCC(CC1)(CC2)c1nnc(-c2ccccc2C(F)(F)F)n1C
: