Target
11-beta-hydroxysteroid dehydrogenase 1
Ligand
BDBM50340794
Substrate
Meas. Tech.
ChEMBL_740556 (CHEMBL1764757)
IC50
1±n/a nM
Citation
 Sun, WMaletic, MMundt, SSShah, KZokian, HLyons, KWaddell, STBalkovec, J Substituted phenyl triazoles as selective inhibitors of 11 β-Hydroxysteroid Dehydrogenase Type 1. Bioorg Med Chem Lett 21:2141-5 (2011)  
Target
Name:
11-beta-hydroxysteroid dehydrogenase 1
Synonyms:
11-DH 11-beta-Hydroxysteroid Dehydrogenase 1 (11-beta-HSD1) 11beta-HSD1A Corticosteroid 11-beta-dehydrogenase isozyme 1 (11-beta-HSD-1) Hsd11 | Hsd11b1
Type:
Enzyme
Mol. Mass.:
32369.70
Organism:
Mus musculus (mouse)
Description:
P50172
Residue:
292
  
Inhibitor
Name:
BDBM50340794
Synonyms:
CHEMBL1760685 | N-(4-(5-(1-(4-chlorophenyl)cyclobutyl)-4-methyl-4H-1,2,4-triazol-3-yl)phenyl)thiophene-2-carboxamide
Type:
Small organic molecule
Emp. Form.:
C24H21ClN4OS
Mol. Mass.:
448.968
SMILES:
Cn1c(nnc1C1(CCC1)c1ccc(Cl)cc1)-c1ccc(NC(=O)c2cccs2)cc1
: