Target
11-beta-hydroxysteroid dehydrogenase 1
Ligand
BDBM50239407
Substrate
Meas. Tech.
ChEMBL_740555 (CHEMBL1764756)
IC50
1.3±n/a nM
Citation
 Sun, WMaletic, MMundt, SSShah, KZokian, HLyons, KWaddell, STBalkovec, J Substituted phenyl triazoles as selective inhibitors of 11 β-Hydroxysteroid Dehydrogenase Type 1. Bioorg Med Chem Lett 21:2141-5 (2011)  
Target
Name:
11-beta-hydroxysteroid dehydrogenase 1
Synonyms:
11-DH 11-beta-Hydroxysteroid Dehydrogenase 1 (11-beta-HSD1) 11-beta-hydroxysteroid dehydrogenase 1 (11HSD1) Corticosteroid 11-beta-dehydrogenase isozyme 1 (11-beta-HSD-1) Corticosteroid 11-beta-dehydrogenase isozyme 1 (11beta-HSD1) HSD11 HSD11L | SDR26C1
Type:
Enzyme
Mol. Mass.:
32409.16
Organism:
Homo sapiens (Human)
Description:
P28845
Residue:
292
  
Inhibitor
Name:
BDBM50239407
Synonyms:
3-(1-(4-chlorophenyl)cyclobutyl)-5,6,7,8,9,10-hexahydro-[1,2,4]triazolo[4,3-a]azocine CHEMBL257149
Type:
Small organic molecule
Emp. Form.:
C18H22ClN3
Mol. Mass.:
315.84
SMILES:
Clc1ccc(cc1)C1(CCC1)c1nnc2CCCCCCn12
: